Reaction Details
TargetXanthine dehydrogenase/oxidase
LigandBDBM121551
Substrate/Competitorn/a
Meas. Tech.Inhibition Activity
IC50 6.2±n/a nM
Citation Song, JUKim, GTChoi, SPJung, CKPark, DSChoi, ESKim, THPark, HJPark, WSPark, HSKoo, KCArtemov, V Compounds effective as xanthine oxidase inhibitors, method for preparing the same, and pharmaceutical composition containing the same US Patent US8729273 Publication Date 5/20/2014
 
Xanthine dehydrogenase/oxidase
Name:Xanthine dehydrogenase/oxidase
Type:Protein
Mol. Mass.:146809.00
Organism:Bos taurus (Bovine)
Description:P80457
Residue:1332
BDBM121551
NameBDBM121551
Synonyms:US8729273, 21
TypeSmall organic molecule
Emp. Form.C18H15N3O2
Mol. Mass.305.3306
SMILESCC(C)n1cc(C#N)c2cc(ccc12)-c1cc(ccn1)C(O)=O