Reaction Details
TargetMisshapen-like kinase 1
LigandBDBM103302
Substrate/Competitorn/a
Meas. Tech.Selectivity screening
IC50 942±0.0 nM
Citation Chaikuad, ATacconi, EMZimmer, JLiang, YGray, NSTarsounas, MKnapp, S A unique inhibitor binding site in ER K1/2 is associated with slow binding kinetics Nat Chem Biol10:853-860 (2014) 
 
Misshapen-like kinase 1
Name:Misshapen-like kinase 1
Type:PROTEIN
Mol. Mass.:149838.92
Organism:Homo sapiens (Human)
Description:ChEMBL_793919
Residue:1332
BDBM103302
NameBDBM103302
Synonyms:SCH772984 | US8546404, 6
TypeSmall organic molecule
Emp. Form.C33H33N9O2
Mol. Mass.587.6742
SMILESO=C(CN1CC[C@@H](C1)C(=O)Nc1ccc2[nH]nc(-c3ccncc3)c2c1)N1CCN(CC1)c1ccc(cc1)-c1ncccn1