Reaction Details
TargetPhosphatidylinositol 4,5-bisphosphate 3-kinase catalytic subunit alpha isoform
LigandBDBM122453
Substrate/Competitorn/a
Meas. Tech.AlphaScreen Assay
Ki 779±n/a nM
IC50 1498±n/a nM
Citation Bo, YYLiu, LNishimura, NNorman, MHSiegmund, ACTamayo, NAYang, KC Inhibitors of PI3 kinase US Patent US8729074 Publication Date 5/20/2014
 
Phosphatidylinositol 4,5-bisphosphate 3-kinase catalytic subunit alpha isoform
Name:Phosphatidylinositol 4,5-bisphosphate 3-kinase catalytic subunit alpha isoform
Type:Enzyme Subunit
Mol. Mass.:124294.87
Organism:Homo sapiens (Human)
Description:P42336
Residue:1068
BDBM122453
NameBDBM122453
Synonyms:US8729074, 11
TypeSmall organic molecule
Emp. Form.C14H12BrN3O2
Mol. Mass.334.168
SMILESCOc1cc(cnc1OC)-c1cnc2ccc(Br)cn12