Reaction Details
TargetPhosphatidylinositol 4,5-bisphosphate 3-kinase catalytic subunit alpha isoform
LigandBDBM122455
Substrate/Competitorn/a
Meas. Tech.AlphaScreen Assay
Ki>1500±n/a nM
IC50 4671±n/a nM
Citation Bo, YYLiu, LNishimura, NNorman, MHSiegmund, ACTamayo, NAYang, KC Inhibitors of PI3 kinase US Patent US8729074 Publication Date 5/20/2014
 
Phosphatidylinositol 4,5-bisphosphate 3-kinase catalytic subunit alpha isoform
Name:Phosphatidylinositol 4,5-bisphosphate 3-kinase catalytic subunit alpha isoform
Type:Enzyme Subunit
Mol. Mass.:124294.87
Organism:Homo sapiens (Human)
Description:P42336
Residue:1068
BDBM122455
NameBDBM122455
Synonyms:US8729074, 13
TypeSmall organic molecule
Emp. Form.C17H16N4O4
Mol. Mass.340.3333
SMILESCOc1cc(cnc1OC)-c1cnc2ccc(cn12)N1CCOC1=O