Reaction Details
TargetPhosphatidylinositol 4,5-bisphosphate 3-kinase catalytic subunit alpha isoform
LigandBDBM122467
Substrate/Competitorn/a
Meas. Tech.AlphaScreen Assay
Ki 465±n/a nM
Citation Bo, YYLiu, LNishimura, NNorman, MHSiegmund, ACTamayo, NAYang, KC Inhibitors of PI3 kinase US Patent US8729074 Publication Date 5/20/2014
 
Phosphatidylinositol 4,5-bisphosphate 3-kinase catalytic subunit alpha isoform
Name:Phosphatidylinositol 4,5-bisphosphate 3-kinase catalytic subunit alpha isoform
Type:Enzyme Subunit
Mol. Mass.:124294.87
Organism:Homo sapiens (Human)
Description:P42336
Residue:1068
BDBM122467
NameBDBM122467
Synonyms:US8729074, 17
TypeSmall organic molecule
Emp. Form.C24H17ClFN5O3S
Mol. Mass.509.94
SMILESFc1ccc(cc1)S(=O)(=O)Nc1cc(cnc1Cl)-c1cnc2ccn(Cc3ccccc3)c(=O)n12