Reaction Details
TargetSerine/threonine-protein kinase mTOR
LigandBDBM122454
Substrate/Competitorn/a
Meas. Tech.In Vitro mTOR Assay
IC50 3748±n/a nM
Citation Bo, YYLiu, LNishimura, NNorman, MHSiegmund, ACTamayo, NAYang, KC Inhibitors of PI3 kinase US Patent US8729074 Publication Date 5/20/2014
 
Serine/threonine-protein kinase mTOR
Name:Serine/threonine-protein kinase mTOR
Type:Rapamycin target protein
Mol. Mass.:288917.12
Organism:Homo sapiens (Human)
Description:P42345
Residue:2549
BDBM122454
NameBDBM122454
Synonyms:US8729074, 12
TypeSmall organic molecule
Emp. Form.C19H16N4O2
Mol. Mass.332.3559
SMILESCOc1cc(cnc1OC)-c1cnc2ccc(cn12)-c1ccncc1