Reaction Details
TargetSerine/threonine-protein kinase mTOR
LigandBDBM122458
Substrate/Competitorn/a
Meas. Tech.In Vitro mTOR Assay
IC50 4519±n/a nM
Citation Bo, YYLiu, LNishimura, NNorman, MHSiegmund, ACTamayo, NAYang, KC Inhibitors of PI3 kinase US Patent US8729074 Publication Date 5/20/2014
 
Serine/threonine-protein kinase mTOR
Name:Serine/threonine-protein kinase mTOR
Type:Rapamycin target protein
Mol. Mass.:288917.12
Organism:Homo sapiens (Human)
Description:P42345
Residue:2549
BDBM122458
NameBDBM122458
Synonyms:US8729074, 16
TypeSmall organic molecule
Emp. Form.C18H20N4O3
Mol. Mass.340.3764
SMILESCOc1cc(cnc1OC)-c1cnc2ccc(cn12)N1CCOCC1