Reaction Details
TargetSerine/threonine-protein kinase mTOR
LigandBDBM122463
Substrate/Competitorn/a
Meas. Tech.In Vitro mTOR Assay
IC50 102±n/a nM
Citation Bo, YYLiu, LNishimura, NNorman, MHSiegmund, ACTamayo, NAYang, KC Inhibitors of PI3 kinase US Patent US8729074 Publication Date 5/20/2014
 
Serine/threonine-protein kinase mTOR
Name:Serine/threonine-protein kinase mTOR
Type:Rapamycin target protein
Mol. Mass.:288917.12
Organism:Homo sapiens (Human)
Description:P42345
Residue:2549
BDBM122463
NameBDBM122463
Synonyms:US8729074, 25
TypeSmall organic molecule
Emp. Form.C17H10Cl2FN5O2S
Mol. Mass.438.263
SMILESFc1ccc(cc1)S(=O)(=O)Nc1cc(cnc1Cl)-c1cnc2ccc(Cl)nn12