Reaction Details
TargetCathepsin S
LigandBDBM122489
Substrate/Competitorn/a
Meas. Tech.Enzyme Inhibition Assay
pH6.5±n/a
IC50 0.593±n/a nM
Citation Banner, DHaap, WKuhn, BLuebbers, TPeters, JSchulz-Gasch, T Pyrrolidine derivatives US Patent US8729061 Publication Date 5/20/2014
 
Cathepsin S
Name:Cathepsin S
Type:Protein
Mol. Mass.:37507.38
Organism:Homo sapiens (Human)
Description:P25774
Residue:331
BDBM122489
NameBDBM122489
Synonyms:US8729061, 19
TypeSmall organic molecule
Emp. Form.C29H29ClF4N4O6S
Mol. Mass.673.075
SMILESCC[C@H](NC(=O)[C@@H]1C[C@H](CN1C(=O)C1(CC1)c1ncc(Cl)cc1F)S(=O)(=O)c1ccccc1C(F)(F)F)C(=O)C(=O)NC1CC1