Reaction Details
TargetCathepsin S
LigandBDBM122513
Substrate/Competitorn/a
Meas. Tech.Enzyme Inhibition Assay
pH6.5±n/a
IC50 0.508±n/a nM
Citation Banner, DHaap, WKuhn, BLuebbers, TPeters, JSchulz-Gasch, T Pyrrolidine derivatives US Patent US8729061 Publication Date 5/20/2014
 
Cathepsin S
Name:Cathepsin S
Type:Protein
Mol. Mass.:37507.38
Organism:Homo sapiens (Human)
Description:P25774
Residue:331
BDBM122513
NameBDBM122513
Synonyms:US8729061, 43
TypeSmall organic molecule
Emp. Form.C28H31Cl2N3O6S
Mol. Mass.608.533
SMILESCCNC(=O)C(=O)[C@H](CC)NC(=O)[C@@H]1C[C@H](CN1C(=O)C1(CC1)c1ccc(Cl)cc1)S(=O)(=O)c1ccccc1Cl