Reaction Details
TargetProcathepsin L
LigandBDBM122525
Substrate/Competitorn/a
Meas. Tech.Enzyme Inhibition Assay
pH6.5±n/a
IC50 2.6±n/a nM
Citation Banner, DHaap, WKuhn, BLuebbers, TPeters, JSchulz-Gasch, T Pyrrolidine derivatives US Patent US8729061 Publication Date 5/20/2014
 
Procathepsin L
Name:Procathepsin L
Type:Enzyme
Mol. Mass.:37557.19
Organism:Homo sapiens (Human)
Description:Purchased from Calbiochem (San Diego, CA).
Residue:333
BDBM122525
NameBDBM122525
Synonyms:US8729061, 55
TypeSmall organic molecule
Emp. Form.C30H35Cl2N3O6S
Mol. Mass.636.586
SMILESCC[C@H](NC(=O)[C@@H]1C[C@H](CN1C(=O)C1(CC1)c1ccc(Cl)cc1)S(=O)(=O)c1ccccc1Cl)C(=O)C(=O)NCC(C)C