Reaction Details
TargetGag-Pol polyprotein [489-587,G537V,H558K,V571A]
LigandBDBM122997
Substrate/Competitorn/a
Meas. Tech.Enzymatic Assay
IC50 0.29±n/a nM
Citation Stranix, BRLavallee, JLeberre, NPerron, VHerbart, DMilot, GPanchal, C Protease inhibitors US Patent US8742158 Publication Date 6/3/2014
 
Gag-Pol polyprotein [489-587,G537V,H558K,V571A]
Name:Gag-Pol polyprotein [489-587,G537V,H558K,V571A]
Type:Protein
Mol. Mass.:10827.77
Organism:Human immunodeficiency virus
Description:P12497[489-587,G537V,H558K,V571A]
Residue:99
BDBM122997
NameBDBM122997
Synonyms:US8742158, EX 19
TypeSmall organic molecule
Emp. Form.C31H40BrN5O6S
Mol. Mass.690.648
SMILESCC(C)CN([C@H](CO)CCCCNC(=O)[C@H](Cc1ccccc1Br)NC(=O)c1cccc(=O)[nH]1)S(=O)(=O)c1ccc(N)cc1