Reaction Details
TargetGag-Pol polyprotein [489-587,G537V,H558K,V571A]
LigandBDBM123011
Substrate/Competitorn/a
Meas. Tech.Enzymatic Assay
IC50 4.122±n/a nM
Citation Stranix, BRLavallee, JLeberre, NPerron, VHerbart, DMilot, GPanchal, C Protease inhibitors US Patent US8742158 Publication Date 6/3/2014
 
Gag-Pol polyprotein [489-587,G537V,H558K,V571A]
Name:Gag-Pol polyprotein [489-587,G537V,H558K,V571A]
Type:Protein
Mol. Mass.:10827.77
Organism:Human immunodeficiency virus
Description:P12497[489-587,G537V,H558K,V571A]
Residue:99
BDBM123011
NameBDBM123011
Synonyms:US8742158, EX 23
TypeSmall organic molecule
Emp. Form.C34H46N4O6S
Mol. Mass.638.817
SMILESCC(C)CN([C@H](CO)CCCCNC(=O)[C@H](Cc1ccccc1C)NC(=O)c1cccc(C)c1O)S(=O)(=O)c1ccc(N)cc1