Reaction Details
TargetGag-Pol polyprotein [489-587,G537V,H558K,V571A]
LigandBDBM122975
Substrate/Competitorn/a
Meas. Tech.Enzymatic Assay
IC50 5.898±n/a nM
Citation Stranix, BRLavallee, JLeberre, NPerron, VHerbart, DMilot, GPanchal, C Protease inhibitors US Patent US8742158 Publication Date 6/3/2014
 
Gag-Pol polyprotein [489-587,G537V,H558K,V571A]
Name:Gag-Pol polyprotein [489-587,G537V,H558K,V571A]
Type:Protein
Mol. Mass.:10827.77
Organism:Human immunodeficiency virus
Description:P12497[489-587,G537V,H558K,V571A]
Residue:99
BDBM122975
NameBDBM122975
Synonyms:US8742158, EX 56
TypeSmall organic molecule
Emp. Form.C35H45N5O4S
Mol. Mass.631.828
SMILESCC(C)CN([C@H](CO)CCCCNC(=O)[C@H](Cc1ccc2ccccc2c1)NCc1ccccn1)S(=O)(=O)c1ccc(N)cc1