Reaction Details
TargetGag-Pol polyprotein [489-587,G537V,H558K,V571A]
LigandBDBM122980
Substrate/Competitorn/a
Meas. Tech.Enzymatic Assay
IC50 0.507±n/a nM
Citation Stranix, BRLavallee, JLeberre, NPerron, VHerbart, DMilot, GPanchal, C Protease inhibitors US Patent US8742158 Publication Date 6/3/2014
 
Gag-Pol polyprotein [489-587,G537V,H558K,V571A]
Name:Gag-Pol polyprotein [489-587,G537V,H558K,V571A]
Type:Protein
Mol. Mass.:10827.77
Organism:Human immunodeficiency virus
Description:P12497[489-587,G537V,H558K,V571A]
Residue:99
BDBM122980
NameBDBM122980
Synonyms:US8742158, EX. 7
TypeSmall organic molecule
Emp. Form.C33H43N5O6S
Mol. Mass.637.789
SMILESCOC(=O)N[C@@H](C(c1ccccc1)c1ccccc1)C(=O)NCCCC[C@@H](N(CC(C)C)S(=O)(=O)c1ccc(N)cc1)C(N)=O