Reaction Details
TargetMuscarinic acetylcholine receptor M3
LigandBDBM123055
Substrate/Competitorn/a
Meas. Tech.Radioligand Binding Assay
Temperature295.15±n/a K
Ki 0.18±n/a nM
IC50 0.25±n/a nM
Commentsextracted
Citation Pfister, JRRescourio, GVenkatraman, MSZhang, X 7-azoniabicyclo[2.2.1]heptane derivatives, methods of production, and pharmaceutical uses thereof US Patent US8742134 Publication Date 6/3/2014
 
Muscarinic acetylcholine receptor M3
Name:Muscarinic acetylcholine receptor M3
Type:Enzyme
Mol. Mass.:66151.03
Organism:Homo sapiens (Human)
Description:P20309
Residue:590
BDBM123055
NameBDBM123055
Synonyms:US8742134, (2) | US8742134, (7)
Typen/a
Emp. Form.C21H30NO3
Mol. Mass.344.4673
SMILESC[N+]1(C)C2CCC1[C@@H](C2)OC(=O)[C@](O)(C1CCCC1)c1ccccc1