Reaction Details
TargetC-C chemokine receptor type 3
LigandBDBM123073
Substrate/Competitorn/a
Meas. Tech.Scintillation Proximity Assay
Ki 4.7±n/a nM
Citation Frank, MHaeberle, HHenry, MPachur, TSantagostino, MStertz, UTrebing, TWerthmann, U Co-crystals and salts of CCR3-inhibitors US Patent US8742115 Publication Date 6/3/2014
 
C-C chemokine receptor type 3
Name:C-C chemokine receptor type 3
Type:Enzyme
Mol. Mass.:41053.88
Organism:Homo sapiens (Human)
Description:P51677
Residue:355
BDBM123073
NameBDBM123073
Synonyms:US8742115, 12
TypeSmall organic molecule
Emp. Form.C28H34ClN5O3
Mol. Mass.524.054
SMILESCc1cc(CN2CCC(CC2)N2[C@H](CCC2=O)C(=O)Nc2cc(ccn2)C(=O)N2CCCC2)ccc1Cl