Reaction Details
TargetC-C chemokine receptor type 3
LigandBDBM123088
Substrate/Competitorn/a
Meas. Tech.Scintillation Proximity Assay
Ki 17.8±n/a nM
Citation Frank, MHaeberle, HHenry, MPachur, TSantagostino, MStertz, UTrebing, TWerthmann, U Co-crystals and salts of CCR3-inhibitors US Patent US8742115 Publication Date 6/3/2014
 
C-C chemokine receptor type 3
Name:C-C chemokine receptor type 3
Type:Enzyme
Mol. Mass.:41053.88
Organism:Homo sapiens (Human)
Description:P51677
Residue:355
BDBM123088
NameBDBM123088
Synonyms:US8742115, 28
TypeSmall organic molecule
Emp. Form.C26H31Cl2N5O3
Mol. Mass.532.462
SMILESCN(C)C(=O)c1cc(C)nc(NC(=O)[C@H]2CCC(=O)N2C2CCN(Cc3ccc(Cl)c(Cl)c3)CC2)c1