Reaction Details
TargetC-C chemokine receptor type 3
LigandBDBM123089
Substrate/Competitorn/a
Meas. Tech.Scintillation Proximity Assay
Ki 4.1±n/a nM
Citation Frank, MHaeberle, HHenry, MPachur, TSantagostino, MStertz, UTrebing, TWerthmann, U Co-crystals and salts of CCR3-inhibitors US Patent US8742115 Publication Date 6/3/2014
 
C-C chemokine receptor type 3
Name:C-C chemokine receptor type 3
Type:Enzyme
Mol. Mass.:41053.88
Organism:Homo sapiens (Human)
Description:P51677
Residue:355
BDBM123089
NameBDBM123089
Synonyms:US8742115, 29
TypeSmall organic molecule
Emp. Form.C29H38ClN5O3
Mol. Mass.540.097
SMILESCC(C)c1cc(cc(NC(=O)[C@H]2CCC(=O)N2C2CCN(Cc3ccc(Cl)c(C)c3)CC2)n1)C(=O)N(C)C