Reaction Details
TargetC-C chemokine receptor type 3
LigandBDBM123094
Substrate/Competitorn/a
Meas. Tech.Scintillation Proximity Assay
Ki 7.9±n/a nM
Citation Frank, MHaeberle, HHenry, MPachur, TSantagostino, MStertz, UTrebing, TWerthmann, U Co-crystals and salts of CCR3-inhibitors US Patent US8742115 Publication Date 6/3/2014
 
C-C chemokine receptor type 3
Name:C-C chemokine receptor type 3
Type:Enzyme
Mol. Mass.:41053.88
Organism:Homo sapiens (Human)
Description:P51677
Residue:355
BDBM123094
NameBDBM123094
Synonyms:US8742115, 34
TypeSmall organic molecule
Emp. Form.C28H32ClN5O3
Mol. Mass.522.038
SMILESCN(C)C(=O)c1cc(NC(=O)[C@H]2CCC(=O)N2C2CCN(Cc3ccc(Cl)c(C)c3)CC2)nc(c1)C#C