Reaction Details
TargetUDP-N-acetylmuramate--L-alanine ligase
LigandBDBM123122
Substrate/Competitorn/a
Meas. Tech.P. aeruginosa MurC assay
Temperature298.15±0 K
IC50 2±n/a nM
Citation Hameed P, SManjrekar, PChinnapattu, MHumnabadkar, VShanbhag, GKedari, CMudugal, NVAmbady, Ade Jonge, BLSadler, CPaul, BSriram, SKaur, PGuptha, SRaichurkar, AFleming, PEyermann, CJMcKinney, DCSambandamurthy, VKPanda, MRavishankar, S Pyrazolopyrimidines Establish MurC as a Vulnerable Target in Pseudomonas aeruginosa and Escherichia coli. ACS Chem Biol9:2274-82 (2014) 
 
UDP-N-acetylmuramate--L-alanine ligase
Name:UDP-N-acetylmuramate--L-alanine ligase
Type:Protein
Mol. Mass.:51977.96
Organism:Pseudomonas aeruginosa (G-proteobacteria)
Description:Q9HW02
Residue:480
BDBM123122
NameBDBM123122
Synonyms:(R)-2-(4-(5-tert-butyl-1-methyl-1H-pyrazol-3-ylamino)-1H-pyrazolo[3,4-d]pyrimidin-6-ylamino)-2-phenylethyl 2-hydroxyethylcarbamate (21)
TypeSmall organic molecule
Emp. Form.C24H31N9O3
Mol. Mass.493.5614
SMILESCn1nc(Nc2nc(N[C@@H](COC(=O)NCCO)c3ccccc3)nc3n[nH]cc23)cc1C(C)(C)C