Reaction Details
TargetUDP-N-acetylmuramate--L-alanine ligase
LigandBDBM123114
Substrate/Competitorn/a
Meas. Tech.E.coli MurC assay
Temperature298.15±0 K
IC50 2±n/a nM
Citation Hameed P, SManjrekar, PChinnapattu, MHumnabadkar, VShanbhag, GKedari, CMudugal, NVAmbady, Ade Jonge, BLSadler, CPaul, BSriram, SKaur, PGuptha, SRaichurkar, AFleming, PEyermann, CJMcKinney, DCSambandamurthy, VKPanda, MRavishankar, S Pyrazolopyrimidines Establish MurC as a Vulnerable Target in Pseudomonas aeruginosa and Escherichia coli. ACS Chem Biol9:2274-82 (2014) 
 
UDP-N-acetylmuramate--L-alanine ligase
Name:UDP-N-acetylmuramate--L-alanine ligase
Type:Protein
Mol. Mass.:53617.78
Organism:Escherichia coli
Description:P17952
Residue:491
BDBM123114
NameBDBM123114
Synonyms:(1R,2S)-1-(4-(5-tert-butyl-1-methyl-1H-pyrazol-3-ylamino)-1H-pyrazolo[3,4-d]pyrimidin-6-ylamino)-2,3-dihydro-1H-inden-2-ol (13)
TypeSmall organic molecule
Emp. Form.C22H26N8O
Mol. Mass.418.4948
SMILESCn1nc(Nc2nc(N[C@H]3[C@@H](O)Cc4ccccc34)nc3n[nH]cc23)cc1C(C)(C)C