Reaction Details
TargetCell division cycle 7-related protein kinase
LigandBDBM123140
Substrate/Competitorn/a
Meas. Tech.MSA assay
pH7.5±n/a
IC50 3±n/a nM
Commentsextracted
Citation Irie, TSawa, ASawa, MAsami, TFunakoshi, YTanaka, C Furanone derivative US Patent US8742113 Publication Date 6/3/2014
 
Cell division cycle 7-related protein kinase
Name:Cell division cycle 7-related protein kinase
Type:Protein
Mol. Mass.:63908.16
Organism:Homo sapiens (Human)
Description:O00311
Residue:574
BDBM123140
NameBDBM123140
Synonyms:US8742113, 126
TypeSmall organic molecule
Emp. Form.C24H24N4O5
Mol. Mass.448.4712
SMILESCCOC(=O)C1C(=O)C(OC1=Nc1ccc(NCCO)cc1C)=Cc1c[nH]c2ncccc12