Reaction Details
TargetSomatostatin receptor type 5
LigandBDBM123240
Substrate/Competitorn/a
Meas. Tech.Binding Assay
pH7.8±n/a
IC50 0.5024±n/a nM
Commentsextracted
Citation Duffy, JLBao, JOndeyka, DLTyagarajan, SShao, PYe, FKatipally, RZwicker, ASherer, ECPlotkin, MAMoningka, RHussain, ZWood, HBUjjainwalla, FRomero, FAFinke, PEZang, YLiu, W Spiroxazolidinone compounds US Patent US8742110 Publication Date 6/3/2014
 
Somatostatin receptor type 5
Name:Somatostatin receptor type 5
Type:Enzyme
Mol. Mass.:39218.02
Organism:Homo sapiens (Human)
Description:P35346
Residue:364
BDBM123240
NameBDBM123240
Synonyms:US8742110, 4-4
TypeSmall organic molecule
Emp. Form.C29H28F2N2O5
Mol. Mass.522.5398
SMILESCCOc1ccc(c(CN2CCC3(CN(C(=O)O3)c3ccc(cc3)C(O)=O)CC2)c1)-c1ccc(F)c(F)c1