Reaction Details
TargetSomatostatin receptor type 5
LigandBDBM123245
Substrate/Competitorn/a
Meas. Tech.Binding Assay
pH7.8±n/a
IC50 0.439±n/a nM
Commentsextracted
Citation Duffy, JLBao, JOndeyka, DLTyagarajan, SShao, PYe, FKatipally, RZwicker, ASherer, ECPlotkin, MAMoningka, RHussain, ZWood, HBUjjainwalla, FRomero, FAFinke, PEZang, YLiu, W Spiroxazolidinone compounds US Patent US8742110 Publication Date 6/3/2014
 
Somatostatin receptor type 5
Name:Somatostatin receptor type 5
Type:Enzyme
Mol. Mass.:39218.02
Organism:Homo sapiens (Human)
Description:P35346
Residue:364
BDBM123245
NameBDBM123245
Synonyms:US8742110, 4-9
TypeSmall organic molecule
Emp. Form.C28H22F6N2O4
Mol. Mass.564.4757
SMILESOC(=O)c1ccc(cc1)N1CC2(CCN(Cc3cc(ccc3-c3ccc(F)c(F)c3F)C(F)(F)F)CC2)OC1=O