Reaction Details
TargetSomatostatin receptor type 5
LigandBDBM123250
Substrate/Competitorn/a
Meas. Tech.Binding Assay
pH7.8±n/a
IC50 0.4067±n/a nM
Commentsextracted
Citation Duffy, JLBao, JOndeyka, DLTyagarajan, SShao, PYe, FKatipally, RZwicker, ASherer, ECPlotkin, MAMoningka, RHussain, ZWood, HBUjjainwalla, FRomero, FAFinke, PEZang, YLiu, W Spiroxazolidinone compounds US Patent US8742110 Publication Date 6/3/2014
 
Somatostatin receptor type 5
Name:Somatostatin receptor type 5
Type:Enzyme
Mol. Mass.:39218.02
Organism:Homo sapiens (Human)
Description:P35346
Residue:364
BDBM123250
NameBDBM123250
Synonyms:US8742110, 4-14
TypeSmall organic molecule
Emp. Form.C29H30FN3O5
Mol. Mass.519.564
SMILESCCOc1cc(CN2CCC3(CN(C(=O)O3)c3ccc(cc3)C(O)=O)CC2)c(cc1C)-c1ccc(F)nc1