Reaction Details
TargetSomatostatin receptor type 5
LigandBDBM123264
Substrate/Competitorn/a
Meas. Tech.Binding Assay
pH7.8±n/a
IC50 0.3946±n/a nM
Commentsextracted
Citation Duffy, JLBao, JOndeyka, DLTyagarajan, SShao, PYe, FKatipally, RZwicker, ASherer, ECPlotkin, MAMoningka, RHussain, ZWood, HBUjjainwalla, FRomero, FAFinke, PEZang, YLiu, W Spiroxazolidinone compounds US Patent US8742110 Publication Date 6/3/2014
 
Somatostatin receptor type 5
Name:Somatostatin receptor type 5
Type:Enzyme
Mol. Mass.:39218.02
Organism:Homo sapiens (Human)
Description:P35346
Residue:364
BDBM123264
NameBDBM123264
Synonyms:US8742110, 4-28
TypeSmall organic molecule
Emp. Form.C28H32N4O5
Mol. Mass.504.5775
SMILESCCOc1cc(CN2CCC3(CN(C(=O)O3)c3ccc(cc3)C(O)=O)CC2)c(cc1C)-n1cc(C)cn1