Reaction Details
TargetGenome polyprotein
LigandBDBM123411
Substrate/Competitorn/a
Meas. Tech.Inhibition Assay
pH7.5±n/a
Temperature303.15±n/a K
Ki 0.1±n/a nM
Commentsextracted
Citation Simmen, KADe Kock, HARaboisson, PJHu, LTahri, ASurleraux, DLNilsson, KMSamuelsson, BBRosenquist, AIvanov, VPelcman, MBelfrage, AKJohansson, PMVendeville, SM Macrocyclic inhibitors of hepatitis C virus US Patent US8741926 Publication Date 6/3/2014
 
Genome polyprotein
Name:Genome polyprotein
Synonyms:NS3-4A protease
Type:Enzyme
Mol. Mass.:72788.46
Organism:Hepatitis C virus
Description:K7XGM7
Residue:681
BDBM123411
NameBDBM123411
Synonyms:US8741926, 56
TypeSmall organic molecule
Emp. Form.C37H44ClN5O7S2
Mol. Mass.770.358
SMILESCOc1ccc2c(O[C@@H]3C[C@@H]4[C@@H](C3)C(=O)N(C)CCCC\C=C/C3C[C@]3(NC4=O)C(=O)NS(=O)(=O)C3CC3)cc(nc2c1Cl)-c1nc(cs1)C(C)C