Reaction Details
TargetSphingosine 1-phosphate receptor 1
LigandBDBM123457
Substrate/Competitorn/a
Meas. Tech.Binding Assay
pH7.4±n/a
Temperature277.15±n/a K
Ki 0.7±n/a nM
Commentsextracted
Citation Muzerelle, MQuattropani, AMontagne, CDorbais, J Oxadiazole fused heterocyclic derivatives useful for the treatment of multiple sclerosis US Patent US8741923 Publication Date 6/3/2014
 
Sphingosine 1-phosphate receptor 1
Name:Sphingosine 1-phosphate receptor 1
Type:Enzyme
Mol. Mass.:42836.02
Organism:Homo sapiens (Human)
Description:P21453
Residue:382
BDBM123457
NameBDBM123457
Synonyms:US8741923, 16
TypeSmall organic molecule
Emp. Form.C28H27N3O4
Mol. Mass.469.5317
SMILESCOCc1cc(ccc1-c1ccccc1C)-c1nc(no1)-c1ccc2CCN(CC(O)=O)Cc2c1