Reaction Details
TargetSphingosine 1-phosphate receptor 1
LigandBDBM123460
Substrate/Competitorn/a
Meas. Tech.Binding Assay
pH7.4±n/a
Temperature277.15±n/a K
Ki 11±n/a nM
Commentsextracted
Citation Muzerelle, MQuattropani, AMontagne, CDorbais, J Oxadiazole fused heterocyclic derivatives useful for the treatment of multiple sclerosis US Patent US8741923 Publication Date 6/3/2014
 
Sphingosine 1-phosphate receptor 1
Name:Sphingosine 1-phosphate receptor 1
Type:Enzyme
Mol. Mass.:42836.02
Organism:Homo sapiens (Human)
Description:P21453
Residue:382
BDBM123460
NameBDBM123460
Synonyms:US8741923, 25
TypeSmall organic molecule
Emp. Form.C23H18N4O
Mol. Mass.366.4152
SMILESCc1ccccc1-c1ccc(cc1C)-c1nc(no1)-c1ccc2[nH]ncc2c1