Reaction Details
TargetSphingosine 1-phosphate receptor 1
LigandBDBM123461
Substrate/Competitorn/a
Meas. Tech.Binding Assay
pH7.4±n/a
Temperature277.15±n/a K
Ki 4.26±n/a nM
Commentsextracted
Citation Muzerelle, MQuattropani, AMontagne, CDorbais, J Oxadiazole fused heterocyclic derivatives useful for the treatment of multiple sclerosis US Patent US8741923 Publication Date 6/3/2014
 
Sphingosine 1-phosphate receptor 1
Name:Sphingosine 1-phosphate receptor 1
Type:Enzyme
Mol. Mass.:42836.02
Organism:Homo sapiens (Human)
Description:P21453
Residue:382
BDBM123461
NameBDBM123461
Synonyms:US8741923, 27
TypeSmall organic molecule
Emp. Form.C24H27N5O2
Mol. Mass.417.5035
SMILESCCC1CCCCN1c1ccc(cc1COC)-c1nc(no1)-c1ccc2nc[nH]c2c1