Reaction Details
TargetG-protein coupled receptor 4
LigandBDBM123488
Substrate/Competitorn/a
Meas. Tech.Radio Ligand Binding Assay
pH8±n/a
IC50 7±n/a nM
Citation Miltz, WOberhauser, BVaupel, AVelcicky, JWeigand, KLeleti, RRLiu, YDu, Z Pyrazolo pyrimidine derivatives US Patent US8748435 Publication Date 6/10/2014
 
G-protein coupled receptor 4
Name:G-protein coupled receptor 4
Type:Enzyme
Mol. Mass.:40994.40
Organism:Homo sapiens (Human)
Description:P46093
Residue:362
BDBM123488
NameBDBM123488
Synonyms:US8748435, 13
TypeSmall organic molecule
Emp. Form.C28H40N6
Mol. Mass.460.6574
SMILESCCc1nn2c(C)cc(C)nc2c1Cc1ccc(\C=C\CN2CCN(C)[C@@H](CN(C)C)C2)cc1