Reaction Details
TargetCore-binding factor subunit beta
LigandBDBM123659
Substrate/Competitorn/a
Meas. Tech.FRET Assay
IC50 1400±n/a nM
Citation Bushweller, JHGrembecka, JIllendula, ADixon, L Inhibitors of inv(16) leukemia US Patent US8748618 Publication Date 6/10/2014
 
Core-binding factor subunit beta
Name:Core-binding factor subunit beta
Type:Enzyme
Mol. Mass.:21507.90
Organism:Homo sapiens (Human)
Description:Q13951
Residue:182
BDBM123659
NameBDBM123659
Synonyms:US8748618, AI-4-70 (or) LD-2-21
TypeSmall organic molecule
Emp. Form.C15H15N3O
Mol. Mass.253.2991
SMILESCC(C)Oc1ccc2nc([nH]c2c1)-c1ccccn1