Reaction Details
TargetCore-binding factor subunit beta
LigandBDBM123654
Substrate/Competitorn/a
Meas. Tech.FRET Assay
IC50 2000±n/a nM
Citation Bushweller, JHGrembecka, JIllendula, ADixon, L Inhibitors of inv(16) leukemia US Patent US8748618 Publication Date 6/10/2014
 
Core-binding factor subunit beta
Name:Core-binding factor subunit beta
Type:Enzyme
Mol. Mass.:21507.90
Organism:Homo sapiens (Human)
Description:Q13951
Residue:182
BDBM123654
NameBDBM123654
Synonyms:US8748618, AI-4-57 (or) LD-1-11C US8748618, NCI- 320656
TypeSmall organic molecule
Emp. Form.C13H11N3O
Mol. Mass.225.2459
SMILESOCc1ccc2nc([nH]c2c1)-c1ccccn1