Reaction Details
TargetCore-binding factor subunit beta
LigandBDBM123662
Substrate/Competitorn/a
Meas. Tech.FRET Assay
IC50 4600±n/a nM
Citation Bushweller, JHGrembecka, JIllendula, ADixon, L Inhibitors of inv(16) leukemia US Patent US8748618 Publication Date 6/10/2014
 
Core-binding factor subunit beta
Name:Core-binding factor subunit beta
Type:Enzyme
Mol. Mass.:21507.90
Organism:Homo sapiens (Human)
Description:Q13951
Residue:182
BDBM123662
NameBDBM123662
Synonyms:US8748618, LD-1-138
TypeSmall organic molecule
Emp. Form.C14H13N3O2
Mol. Mass.255.2719
SMILESOCc1cc2nc([nH]c2cc1CO)-c1ccccn1