Reaction Details
TargetCore-binding factor subunit beta
LigandBDBM123666
Substrate/Competitorn/a
Meas. Tech.FRET Assay
IC50 5300±n/a nM
Citation Bushweller, JHGrembecka, JIllendula, ADixon, L Inhibitors of inv(16) leukemia US Patent US8748618 Publication Date 6/10/2014
 
Core-binding factor subunit beta
Name:Core-binding factor subunit beta
Type:Enzyme
Mol. Mass.:21507.90
Organism:Homo sapiens (Human)
Description:Q13951
Residue:182
BDBM123666
NameBDBM123666
Synonyms:US8748618, AI-4-46
TypeSmall organic molecule
Emp. Form.C13H11N3
Mol. Mass.209.2465
SMILESCc1cccc2[nH]c(nc12)-c1ccccn1