Reaction Details
TargetCore-binding factor subunit beta
LigandBDBM123667
Substrate/Competitorn/a
Meas. Tech.FRET Assay
IC50 4300±n/a nM
Citation Bushweller, JHGrembecka, JIllendula, ADixon, L Inhibitors of inv(16) leukemia US Patent US8748618 Publication Date 6/10/2014
 
Core-binding factor subunit beta
Name:Core-binding factor subunit beta
Type:Enzyme
Mol. Mass.:21507.90
Organism:Homo sapiens (Human)
Description:Q13951
Residue:182
BDBM123667
NameBDBM123667
Synonyms:US8748618, LD-1-23
TypeSmall organic molecule
Emp. Form.C14H13N3
Mol. Mass.223.2731
SMILESCc1ccc2nc([nH]c2c1C)-c1ccccn1