Reaction Details
TargetCore-binding factor subunit beta
LigandBDBM123671
Substrate/Competitorn/a
Meas. Tech.FRET Assay
IC50 1300±n/a nM
Citation Bushweller, JHGrembecka, JIllendula, ADixon, L Inhibitors of inv(16) leukemia US Patent US8748618 Publication Date 6/10/2014
 
Core-binding factor subunit beta
Name:Core-binding factor subunit beta
Type:Enzyme
Mol. Mass.:21507.90
Organism:Homo sapiens (Human)
Description:Q13951
Residue:182
BDBM123671
NameBDBM123671
Synonyms:US8748618, AI-10-51
TypeSmall organic molecule
Emp. Form.C13H10ClN3O
Mol. Mass.259.691
SMILESOCc1cc2nc([nH]c2cc1Cl)-c1ccccn1