Reaction Details
TargetCore-binding factor subunit beta
LigandBDBM123679
Substrate/Competitorn/a
Meas. Tech.FRET Assay
IC50 2500±n/a nM
Citation Bushweller, JHGrembecka, JIllendula, ADixon, L Inhibitors of inv(16) leukemia US Patent US8748618 Publication Date 6/10/2014
 
Core-binding factor subunit beta
Name:Core-binding factor subunit beta
Type:Enzyme
Mol. Mass.:21507.90
Organism:Homo sapiens (Human)
Description:Q13951
Residue:182
BDBM123679
NameBDBM123679
Synonyms:US8748618, AI-4-61 (or) AI-10-52
TypeSmall organic molecule
Emp. Form.C14H13N3O2
Mol. Mass.255.2719
SMILESCOc1ccc(nc1)-c1nc2ccc(CO)cc2[nH]1