Reaction Details
TargetCore-binding factor subunit beta
LigandBDBM123685
Substrate/Competitorn/a
Meas. Tech.FRET Assay
IC50 2000±n/a nM
Citation Bushweller, JHGrembecka, JIllendula, ADixon, L Inhibitors of inv(16) leukemia US Patent US8748618 Publication Date 6/10/2014
 
Core-binding factor subunit beta
Name:Core-binding factor subunit beta
Type:Enzyme
Mol. Mass.:21507.90
Organism:Homo sapiens (Human)
Description:Q13951
Residue:182
BDBM123685
NameBDBM123685
Synonyms:US8748618, AI-10-77
TypeSmall organic molecule
Emp. Form.C14H11N3O3
Mol. Mass.269.2554
SMILESCOc1ccnc(c1)-c1nc2ccc(OC=O)cc2[nH]1