Reaction Details
TargetHigh affinity cGMP-specific 3',5'-cyclic phosphodiesterase 9A
LigandBDBM123687
Substrate/Competitorn/a
Meas. Tech.In Vitro Inhibition Assay
pH7.5±n/a
IC50 110±n/a nM
Commentsextracted
Citation Hendrix, MBöβ, FBurkhardt, NErb, CTersteegen, AVan Kampen, M Alkyl-substituted pyrazolopyrimidines US Patent US8741907 Publication Date 6/3/2014
 
High affinity cGMP-specific 3',5'-cyclic phosphodiesterase 9A
Name:High affinity cGMP-specific 3',5'-cyclic phosphodiesterase 9A
Type:Protein
Mol. Mass.:68488.40
Organism:Homo sapiens (Human)
Description:O76083
Residue:593
BDBM123687
NameBDBM123687
Synonyms:US8741907, 3 | US9067945, 2
TypeSmall organic molecule
Emp. Form.C17H26N4O
Mol. Mass.302.4145
SMILESCCC(CC)n1ncc2c1nc(CC1CCCCC1)[nH]c2=O