Reaction Details
TargetHigh affinity cGMP-specific 3',5'-cyclic phosphodiesterase 9A
LigandBDBM123689
Substrate/Competitorn/a
Meas. Tech.In Vitro Inhibition Assay
pH7.5±n/a
IC50 6±n/a nM
Commentsextracted
Citation Hendrix, MBöβ, FBurkhardt, NErb, CTersteegen, AVan Kampen, M Alkyl-substituted pyrazolopyrimidines US Patent US8741907 Publication Date 6/3/2014
 
High affinity cGMP-specific 3',5'-cyclic phosphodiesterase 9A
Name:High affinity cGMP-specific 3',5'-cyclic phosphodiesterase 9A
Type:Protein
Mol. Mass.:68488.40
Organism:Homo sapiens (Human)
Description:O76083
Residue:593
BDBM123689
NameBDBM123689
Synonyms:US8741907, 6
TypeSmall organic molecule
Emp. Form.C16H20N4O
Mol. Mass.284.3562
SMILESO=c1[nH]c(CC2CCC=C2)nc2n(ncc12)C1CCCC1