Reaction Details
TargetPhospholipase D2
LigandBDBM123744
Substrate/Competitorn/a
Meas. Tech.PLD In Vitro Kinetic Assay
Temperature310.15±0 K
IC50 15±n/a nM
Citation Kulkarni, AQuang, PCurry, VKeyes, RZhou, WCho, HBaffoe, JTorok, BStieglitz, K 1,3-disubstituted-4-aminopyrazolo [3, 4-d] pyrimidines, a new class of potent inhibitors for phospholipase D. Chem Biol Drug Des84:270-81 (2014) 
 
Phospholipase D2
Name:Phospholipase D2
Type:Protein
Mol. Mass.:106002.47
Organism:Homo sapiens (Human)
Description:n/a
Residue:933
BDBM123744
NameBDBM123744
Synonyms:5-Fluoro-N-(2-(4-(2-Oxo-2,3-dihydro-1H-benzo[d]imidazol-1-yl)piperidin-1-yl)ethyl)-1H-indole-2-carboxamide, 14 FIPI hydrochloride hydrate (FIPI_HCl)
TypeSmall organic molecule
Emp. Form.C23H24FN5O2
Mol. Mass.421.4674
SMILESFc1ccc2[nH]c(cc2c1)C(=O)NCCN1CCC(CC1)n1c2ccccc2[nH]c1=O