Reaction Details
TargetPhospholipase D1
LigandBDBM123748
Substrate/Competitorn/a
Meas. Tech.PLD In Vitro Kinetic Assay
Temperature310.15±0 K
IC50 350±n/a nM
Citation Kulkarni, AQuang, PCurry, VKeyes, RZhou, WCho, HBaffoe, JTorok, BStieglitz, K 1,3-disubstituted-4-aminopyrazolo [3, 4-d] pyrimidines, a new class of potent inhibitors for phospholipase D. Chem Biol Drug Des84:270-81 (2014) 
 
Phospholipase D1
Name:Phospholipase D1
Type:Protein
Mol. Mass.:124219.92
Organism:Homo sapiens (Human)
Description:Q13393
Residue:1074
BDBM123748
NameBDBM123748
Synonyms:1-(tert-butyl)-3-methyl-1H-pyrazolo[3,4-d]pyrimidin-4-amine (6) | 1-tert-butyl-3-methyl-1H-pyrazolo[3,4-d]pyrimidin-4-amine (6)
TypeSmall organic molecule
Emp. Form.C10H15N5
Mol. Mass.205.2596
SMILESCc1nn(c2ncnc(N)c12)C(C)(C)C