Reaction Details
TargetPhospholipase D2
LigandBDBM123746
Substrate/Competitorn/a
Meas. Tech.PLD In Vitro Kinetic Assay
Temperature310.15±0 K
IC50 15±n/a nM
Citation Kulkarni, AQuang, PCurry, VKeyes, RZhou, WCho, HBaffoe, JTorok, BStieglitz, K 1,3-disubstituted-4-aminopyrazolo [3, 4-d] pyrimidines, a new class of potent inhibitors for phospholipase D. Chem Biol Drug Des84:270-81 (2014) 
 
Phospholipase D2
Name:Phospholipase D2
Type:Protein
Mol. Mass.:106002.47
Organism:Homo sapiens (Human)
Description:n/a
Residue:933
BDBM123746
NameBDBM123746
Synonyms:1-(4-methoxyphenyl)-3-phenyl-1H-pyrazolo[3,4-d]pyrimidin-4-amine (2)
TypeSmall organic molecule
Emp. Form.C18H15N5O
Mol. Mass.317.3446
SMILESCOc1ccc(cc1)-n1nc(-c2ccccc2)c2c(N)ncnc12