Reaction Details
TargetPhospholipase D2
LigandBDBM123747
Substrate/Competitorn/a
Meas. Tech.PLD In Vitro Kinetic Assay
Temperature310.15±0 K
IC50 290±n/a nM
Citation Kulkarni, AQuang, PCurry, VKeyes, RZhou, WCho, HBaffoe, JTorok, BStieglitz, K 1,3-disubstituted-4-aminopyrazolo [3, 4-d] pyrimidines, a new class of potent inhibitors for phospholipase D. Chem Biol Drug Des84:270-81 (2014) 
 
Phospholipase D2
Name:Phospholipase D2
Type:Protein
Mol. Mass.:106002.47
Organism:Homo sapiens (Human)
Description:n/a
Residue:933
BDBM123747
NameBDBM123747
Synonyms:1-(tert-butyl)-3-phenyl-1H-pyrazolo[3,4-d]pyrimidin-4-amine (5) CHEMBL2069938 US9765037, Compound 140
TypeSmall organic molecule
Emp. Form.C15H17N5
Mol. Mass.267.329
SMILESCC(C)(C)n1nc(-c2ccccc2)c2c(N)ncnc12