Reaction Details
TargetPhospholipase D
LigandBDBM3003
Substrate/Competitorn/a
Meas. Tech.PLD In Vitro Kinetic Assay
Temperature310.15±0 K
IC50 700±n/a nM
Citation Kulkarni, AQuang, PCurry, VKeyes, RZhou, WCho, HBaffoe, JTorok, BStieglitz, K 1,3-disubstituted-4-aminopyrazolo [3, 4-d] pyrimidines, a new class of potent inhibitors for phospholipase D. Chem Biol Drug Des84:270-81 (2014) 
 
Phospholipase D
Name:Phospholipase D
Synonyms:Phospholipase D (PLD_sp)
Type:Protein
Mol. Mass.:54006.04
Organism:Streptomyces sp. PMF
Description:P84147
Residue:506
BDBM3003
NameBDBM3003
TypeSmall organic molecule
Emp. Form.C17H13N5
Mol. Mass.287.3186
SMILESNc1ncnc2n(nc(-c3ccccc3)c12)-c1ccccc1