Reaction Details
TargetBeta-adrenergic receptor kinase 1
LigandBDBM50173323
Substrate/Competitorn/a
Meas. Tech.Assays for Inhibition of GRKs
pH7±n/a
IC50 120±n/a nM
Commentsextracted
Citation Larsen, SDHoman, KWaldschmidt, HTesmer, JJ G protein-coupled receptor kinase 2 inhibitors and methods for use of the same US Patent US10023564 Publication Date 7/17/2018
 
Beta-adrenergic receptor kinase 1
Name:Beta-adrenergic receptor kinase 1
Type:Enzyme
Mol. Mass.:79581.30
Organism:Homo sapiens (Human)
Description:P25098
Residue:689
BDBM50173323
NameBDBM50173323
Synonyms:CHEMBL3808621 | US10023564, Example 2
TypeSmall organic molecule
Emp. Form.C27H21F3N6O3
Mol. Mass.534.4892
SMILESCC1=C(C(NC(=O)N1)c1ccc(F)c(c1)C(=O)NCc1c(F)cccc1F)C(=O)Nc1ccc2[nH]ncc2c1