Reaction Details
TargetG protein-coupled receptor kinase 5
LigandBDBM50173306
Substrate/Competitorn/a
Meas. Tech.Assays for Inhibition of GRKs
pH7±n/a
IC50>100000±n/a nM
Commentsextracted
Citation Larsen, SDHoman, KWaldschmidt, HTesmer, JJ G protein-coupled receptor kinase 2 inhibitors and methods for use of the same US Patent US10023564 Publication Date 7/17/2018
 
G protein-coupled receptor kinase 5
Name:G protein-coupled receptor kinase 5
Type:PROTEIN
Mol. Mass.:67798.93
Organism:Homo sapiens (Human)
Description:ChEMBL_1280627
Residue:590
BDBM50173306
NameBDBM50173306
Synonyms:CHEMBL3808565 | US10023564, Example 7
TypeSmall organic molecule
Emp. Form.C27H24FN7O3
Mol. Mass.513.523
SMILESCC1=C(C(NC(=O)N1)c1ccc(F)c(c1)C(=O)NCCc1ccncc1)C(=O)Nc1ccc2[nH]ncc2c1