Reaction Details
TargetBeta-adrenergic receptor kinase 1
LigandBDBM50173308
Substrate/Competitorn/a
Meas. Tech.Assays for Inhibition of GRKs
pH7±n/a
IC50 130±n/a nM
Commentsextracted
Citation Larsen, SDHoman, KWaldschmidt, HTesmer, JJ G protein-coupled receptor kinase 2 inhibitors and methods for use of the same US Patent US10023564 Publication Date 7/17/2018
 
Beta-adrenergic receptor kinase 1
Name:Beta-adrenergic receptor kinase 1
Type:Enzyme
Mol. Mass.:79581.30
Organism:Homo sapiens (Human)
Description:P25098
Residue:689
BDBM50173308
NameBDBM50173308
Synonyms:CHEMBL3810271 | US10023564, Example 9
TypeSmall organic molecule
Emp. Form.C27H21Cl2FN6O3
Mol. Mass.567.398
SMILESCC1=C(C(NC(=O)N1)c1ccc(F)c(c1)C(=O)NCc1c(Cl)cccc1Cl)C(=O)Nc1ccc2[nH]ncc2c1